{"text_format":"1","workbook":"xlsx","n_sheets":2,"sheets":["ヒヤリング","結果一覧"],"not_rendered":{"charts":0,"images":0,"macros":1,"external_links":0,"defined_names":4,"comments":0,"pivot_tables":0},"unopened":[],"bounds":{"document_bytes":16777216,"sheet_cells":100000,"rows_first":2000,"rows_last":500,"rows_between":2000,"halvings":0,"cell_chars":16384,"cell_head_chars":4096},"cells_cut":0,"cells_raw":0,"read":"whole","date_system":"1900"}

{"sheet":"ヒヤリング","index":0,"n_rows":80,"n_cols":27,"rows_kept":80,"cut":false,"hidden":false,"merged":[]}
[]
[]
[null,"※PLM製品(Product Lifecycle Management)とは、設計、設計検証、生産準備、技術情報管理を行う製品群を示す"]
[]
[null,null,null,null,null,null,null,null,null,null,null,null,null,null,null,null,"COLMINA 設計製造支援  iCAD SX V8 STD",null,null,null,null,null,null,{"$f":"color1","v":40},{"$f":"IF(X5=1,Q5,\"\")","v":""},"A5149KC3D",75000]
[]
[]
[null,null,null,null,null,null,null,null,null,null,null,null,null,null,null,null,"COLMINA 設計製造支援  iCAD SX V8 PRO ",null,null,null,null,null,null,{"$f":"color1","v":40},{"$f":"IF(X8=1,Q8,\"\")","v":""},"A5149KC2D",90000]
[]
[]
[]
[null,null,null,null,null,null,null,null,null,null,null,null,null,null,null,null,"COLMINA 設計製造支援  iCAD SX V8 MEI ",null,null,null,null,null,null,{"$f":"color1","v":40},{"$f":"IF(X12=1,Q12,\"\")","v":""},"A5149KC1D",143000]
[]
[]
[]
[null,null,null,null,null,null,null,null,null,null,null,null,null,null,null,null,null,null,null,null,"COLMINA iCAD SX 設計業務効率化ツール 部品属性設定 ",null,null,{"$f":"color2","v":40},{"$f":"IF(X16=1,U16,\"\")","v":""},"A5149QK6D",3000]
[]
[null,null,null,null,null,null,null,null,null,null,null,null,null,null,null,null,null,null,null,null,"COLMINA iCAD SX 設計業務効率化ツール 部品表作成 ",null,null,{"$f":"color2","v":40},{"$f":"IF(X18=1,U18,\"\")","v":""},"A5149QK8D",3000]
[]
[null,null,null,null,null,null,null,null,null,null,null,null,null,null,null,null,null,null,null,null,"COLMINA iCAD SX 設計業務効率化ツール 表題欄一括設定 ",null,null,{"$f":"color2","v":40},{"$f":"IF(X20=1,U20,\"\")","v":""},"A5149QKAD",3000]
[]
[null,null,null,null,null,null,null,null,null,null,null,null,null,null,null,null,null,null,null,null,"COLMINA iCAD SX 設計業務効率化ツール 検図支援ツール ",null,null,{"$f":"color2","v":40},{"$f":"IF(X22=1,U22,\"\")","v":""},"A5149QKLD",3000]
[]
[null,null,null,null,null,null,null,null,null,null,null,null,null,null,null,null,null,null,null,null,"COLMINA iCAD SX 設計業務効率化ツール コマンドランチャー ",null,null,{"$f":"color2","v":40},{"$f":"IF(X24=1,U24,\"\")","v":""},"A5149QKGD",1000]
[]
[null,null,null,null,null,null,null,null,null,null,null,null,null,null,null,null,null,null,null,null,"COLMINA iCAD SX 設計業務効率化ツール 雲マーク作成 ",null,null,{"$f":"color2","v":40},{"$f":"IF(X26=1,U26,\"\")","v":""},"A5149QKJD",1500]
[]
[null,null,null,null,null,null,null,null,null,null,null,null,null,null,null,null,null,null,null,null,"COLMINA iCAD SX 設計業務効率化ツール 部品風船作成 ",null,null,{"$f":"color2","v":40},{"$f":"IF(X28=1,U28,\"\")","v":""},"A5149QKCD",3000]
[]
[null,null,null,null,null,null,null,null,null,null,null,null,null,null,null,null,null,null,null,null,"COLMINA iCAD SX 設計業務効率化ツール 穴検証ツール ",null,null,{"$f":"color2","v":40},{"$f":"IF(X30=1,U30,\"\")","v":""},"A5149QKED",3000]
[]
[null,null,null,null,null,null,null,null,null,null,null,null,null,null,null,null,null,null,null,null,"COLMINA iCAD SX 設計業務効率化ツール 階段自動設計 ",null,null,{"$f":"color2","v":40},{"$f":"IF(X32=1,U32,\"\")","v":""},"A5149QKND",8000]
[]
[null,null,null,null,null,null,null,null,null,null,null,null,null,null,null,null,null,null,null,null,"COLMINA iCAD SX 設計業務効率化ツール 手摺自動設計 ",null,null,{"$f":"color2","v":40},{"$f":"IF(X34=1,U34,\"\")","v":""},"A5149QKQD",8000]
[]
[]
[null,null,null,null,null,null,null,null,null,null,null,null,null,null,null,null,"COLMINA CAE 設計者向け構造解析 V8 Intro",null,null,null,null,null,null,{"$f":"color1","v":40},{"$f":"IF(X37=1,Q37,\"\")","v":""},"A5149K77D",46000]
[]
[null,null,null,null,null,null,null,null,null,null,null,null,null,null,null,null,"COLMINA CAE 設計者向け構造解析 V8 Basic",null,null,null,null,null,null,{"$f":"color1","v":40},{"$f":"IF(X39=1,Q39,\"\")","v":""},"A5149K78D",88000]
[]
[]
[null,null,null,null,null,null,null,null,null,null,null,null,null,null,null,null,"COLMINA CAE 設計者向け構造解析 V8 Standard",null,null,null,null,null,null,{"$f":"color1","v":40},{"$f":"IF(X42=1,Q42,\"\")","v":""},"A5149K79D",129000]
[]
[]
[]
[]
[null,null,null,null,null,null,null,null,null,null,null,null,null,null,null,null,"COLMINA CAE 設計者向け構造解析 V8 Professional",null,null,null,null,null,null,{"$f":"color1","v":40},{"$f":"IF(X47=1,Q47,\"\")","v":""},"A5149K7AD",171000]
[]
[]
[]
[]
[]
[null,null,null,null,null,null,null,null,null,null,null,null,null,null,null,null,"COLMINA Design Review\n高速リモートデスクトップ Standard ",null,null,null,null,null,null,{"$f":"color1","v":40},{"$f":"IF(X53=1,Q53,\"\")","v":""},"A5149KP6D",8000]
[]
[]
[null,null,null,null,null,null,null,null,null,null,null,null,null,null,null,null,"COLMINA Design Review\n高速リモートデスクトップ Standard　マルチデバイス ",null,null,null,null,null,null,{"$f":"color1","v":40},{"$f":"IF(X56=1,Q56,\"\")","v":""},"A5149KPAD",1000]
[]
[]
[null,null,null,null,null,null,null,null,null,null,null,null,null,null,null,null,"COLMINA Design Review\n高速リモートデスクトップ Professional ",null,null,null,null,null,null,{"$f":"color1","v":40},{"$f":"IF(X59=1,Q59,\"\")","v":""},"A5149KP8D",18000]
[]
[]
[]
[]
[]
[null,null,null,null,null,null,null,null,null,null,null,null,null,null,null,null,"COLMINA デジタル生産準備 VPS STANDARD ",null,null,null,null,null,null,{"$f":"color1","v":40},{"$f":"IF(X65=1,Q65,\"\")","v":""},"A5149K7QD",288000]
[]
[]
[null,null,null,null,null,null,null,null,null,null,null,null,null,null,null,null,"COLMINA デジタル生産準備 VPS IOC ",null,null,null,null,null,null,{"$f":"color1","v":40},{"$f":"IF(X68=1,Q68,\"\")","v":""},"A5149K9BD",233000]
[]
[]
[null,null,null,null,null,null,null,null,null,null,null,null,null,null,null,null,"COLMINA デジタル生産準備 VPS GP4 VMS ",null,null,null,null,null,null,{"$f":"color1","v":40},{"$f":"IF(X71=1,Q71,\"\")","v":""},"A5149K9ED",230000]
[]
[]
[]
[]
[null,null,null,null,null,null,null,null,null,null,null,null,null,null,null,null,"COLMINA CADデータ管理 ",null,null,null,null,null,null,{"$f":"color1","v":40},{"$f":"IF(X76=1,Q76,\"\")","v":""},"A5149K74D,A5149K75D",105000105000]
[]
[null,null,null,null,null,null,null,null,null,null,null,null,null,null,null,null,"COLMINA CAE 技術情報DB化システム ",null,null,null,null,null,null,{"$f":"color1","v":40},{"$f":"IF(X78=1,Q78,\"\")","v":""},"A5149K7CD",101000]
[]
[null,null,null,null,null,null,null,null,null,null,null,null,null,null,null,null,"COLMINA 技術ファイル管理 for Manufacturing ",null,null,null,null,null,null,{"$f":"color1","v":40},{"$f":"IF(X80=1,Q80,\"\")","v":""},"A5149K6FD",24170]
{"$rows_left_out":1}
{"sheet":"結果一覧","index":1,"n_rows":231,"n_cols":4,"rows_kept":231,"cut":false,"hidden":false,"merged":[]}
[]
[null,"No","品名","価格"]
[null,1,{"$f":"IFERROR(INDEX(ヒヤリング!Y:Y,1/LARGE(INDEX((ヒヤリング!$Y$5:$Y$80<>\"\")/ROW(ヒヤリング!$Y$5:$Y$80),0),ROW(ヒヤリング!Y1))),\"\")","v":""},{"$f":"IFERROR(INDEX(ヒヤリング!AA:AA,1/LARGE(INDEX((ヒヤリング!$Y$5:$Y$80<>\"\")/ROW(ヒヤリング!$Y$5:$Y$80),0),ROW(ヒヤリング!AA1))),\"\")","v":""}]
[null,2,{"$f":"IFERROR(INDEX(ヒヤリング!Y:Y,1/LARGE(INDEX((ヒヤリング!$Y$5:$Y$80<>\"\")/ROW(ヒヤリング!$Y$5:$Y$80),0),ROW(ヒヤリング!Y2))),\"\")","v":""},{"$f":"IFERROR(INDEX(ヒヤリング!AA:AA,1/LARGE(INDEX((ヒヤリング!$Y$5:$Y$80<>\"\")/ROW(ヒヤリング!$Y$5:$Y$80),0),ROW(ヒヤリング!AA2))),\"\")","v":""}]
[null,3,{"$f":"IFERROR(INDEX(ヒヤリング!Y:Y,1/LARGE(INDEX((ヒヤリング!$Y$5:$Y$80<>\"\")/ROW(ヒヤリング!$Y$5:$Y$80),0),ROW(ヒヤリング!Y3))),\"\")","v":""},{"$f":"IFERROR(INDEX(ヒヤリング!AA:AA,1/LARGE(INDEX((ヒヤリング!$Y$5:$Y$80<>\"\")/ROW(ヒヤリング!$Y$5:$Y$80),0),ROW(ヒヤリング!AA3))),\"\")","v":""}]
[null,4,{"$f":"IFERROR(INDEX(ヒヤリング!Y:Y,1/LARGE(INDEX((ヒヤリング!$Y$5:$Y$80<>\"\")/ROW(ヒヤリング!$Y$5:$Y$80),0),ROW(ヒヤリング!Y4))),\"\")","v":""},{"$f":"IFERROR(INDEX(ヒヤリング!AA:AA,1/LARGE(INDEX((ヒヤリング!$Y$5:$Y$80<>\"\")/ROW(ヒヤリング!$Y$5:$Y$80),0),ROW(ヒヤリング!AA4))),\"\")","v":""}]
[null,5,{"$f":"IFERROR(INDEX(ヒヤリング!Y:Y,1/LARGE(INDEX((ヒヤリング!$Y$5:$Y$80<>\"\")/ROW(ヒヤリング!$Y$5:$Y$80),0),ROW(ヒヤリング!Y5))),\"\")","v":""},{"$f":"IFERROR(INDEX(ヒヤリング!AA:AA,1/LARGE(INDEX((ヒヤリング!$Y$5:$Y$80<>\"\")/ROW(ヒヤリング!$Y$5:$Y$80),0),ROW(ヒヤリング!AA5))),\"\")","v":""}]
[null,6,{"$f":"IFERROR(INDEX(ヒヤリング!Y:Y,1/LARGE(INDEX((ヒヤリング!$Y$5:$Y$80<>\"\")/ROW(ヒヤリング!$Y$5:$Y$80),0),ROW(ヒヤリング!Y6))),\"\")","v":""},{"$f":"IFERROR(INDEX(ヒヤリング!AA:AA,1/LARGE(INDEX((ヒヤリング!$Y$5:$Y$80<>\"\")/ROW(ヒヤリング!$Y$5:$Y$80),0),ROW(ヒヤリング!AA6))),\"\")","v":""}]
[null,7,{"$f":"IFERROR(INDEX(ヒヤリング!Y:Y,1/LARGE(INDEX((ヒヤリング!$Y$5:$Y$80<>\"\")/ROW(ヒヤリング!$Y$5:$Y$80),0),ROW(ヒヤリング!Y7))),\"\")","v":""},{"$f":"IFERROR(INDEX(ヒヤリング!AA:AA,1/LARGE(INDEX((ヒヤリング!$Y$5:$Y$80<>\"\")/ROW(ヒヤリング!$Y$5:$Y$80),0),ROW(ヒヤリング!AA7))),\"\")","v":""}]
[null,8,{"$f":"IFERROR(INDEX(ヒヤリング!Y:Y,1/LARGE(INDEX((ヒヤリング!$Y$5:$Y$80<>\"\")/ROW(ヒヤリング!$Y$5:$Y$80),0),ROW(ヒヤリング!Y8))),\"\")","v":""},{"$f":"IFERROR(INDEX(ヒヤリング!AA:AA,1/LARGE(INDEX((ヒヤリング!$Y$5:$Y$80<>\"\")/ROW(ヒヤリング!$Y$5:$Y$80),0),ROW(ヒヤリング!AA8))),\"\")","v":""}]
[null,9,{"$f":"IFERROR(INDEX(ヒヤリング!Y:Y,1/LARGE(INDEX((ヒヤリング!$Y$5:$Y$80<>\"\")/ROW(ヒヤリング!$Y$5:$Y$80),0),ROW(ヒヤリング!Y9))),\"\")","v":""},{"$f":"IFERROR(INDEX(ヒヤリング!AA:AA,1/LARGE(INDEX((ヒヤリング!$Y$5:$Y$80<>\"\")/ROW(ヒヤリング!$Y$5:$Y$80),0),ROW(ヒヤリング!AA9))),\"\")","v":""}]
[null,10,{"$f":"IFERROR(INDEX(ヒヤリング!Y:Y,1/LARGE(INDEX((ヒヤリング!$Y$5:$Y$80<>\"\")/ROW(ヒヤリング!$Y$5:$Y$80),0),ROW(ヒヤリング!Y10))),\"\")","v":""},{"$f":"IFERROR(INDEX(ヒヤリング!AA:AA,1/LARGE(INDEX((ヒヤリング!$Y$5:$Y$80<>\"\")/ROW(ヒヤリング!$Y$5:$Y$80),0),ROW(ヒヤリング!AA10))),\"\")","v":""}]
[null,11,{"$f":"IFERROR(INDEX(ヒヤリング!Y:Y,1/LARGE(INDEX((ヒヤリング!$Y$5:$Y$80<>\"\")/ROW(ヒヤリング!$Y$5:$Y$80),0),ROW(ヒヤリング!Y11))),\"\")","v":""},{"$f":"IFERROR(INDEX(ヒヤリング!AA:AA,1/LARGE(INDEX((ヒヤリング!$Y$5:$Y$80<>\"\")/ROW(ヒヤリング!$Y$5:$Y$80),0),ROW(ヒヤリング!AA11))),\"\")","v":""}]
[null,12,{"$f":"IFERROR(INDEX(ヒヤリング!Y:Y,1/LARGE(INDEX((ヒヤリング!$Y$5:$Y$80<>\"\")/ROW(ヒヤリング!$Y$5:$Y$80),0),ROW(ヒヤリング!Y12))),\"\")","v":""},{"$f":"IFERROR(INDEX(ヒヤリング!AA:AA,1/LARGE(INDEX((ヒヤリング!$Y$5:$Y$80<>\"\")/ROW(ヒヤリング!$Y$5:$Y$80),0),ROW(ヒヤリング!AA12))),\"\")","v":""}]
[null,13,{"$f":"IFERROR(INDEX(ヒヤリング!Y:Y,1/LARGE(INDEX((ヒヤリング!$Y$5:$Y$80<>\"\")/ROW(ヒヤリング!$Y$5:$Y$80),0),ROW(ヒヤリング!Y13))),\"\")","v":""},{"$f":"IFERROR(INDEX(ヒヤリング!AA:AA,1/LARGE(INDEX((ヒヤリング!$Y$5:$Y$80<>\"\")/ROW(ヒヤリング!$Y$5:$Y$80),0),ROW(ヒヤリング!AA13))),\"\")","v":""}]
[null,14,{"$f":"IFERROR(INDEX(ヒヤリング!Y:Y,1/LARGE(INDEX((ヒヤリング!$Y$5:$Y$80<>\"\")/ROW(ヒヤリング!$Y$5:$Y$80),0),ROW(ヒヤリング!Y14))),\"\")","v":""},{"$f":"IFERROR(INDEX(ヒヤリング!AA:AA,1/LARGE(INDEX((ヒヤリング!$Y$5:$Y$80<>\"\")/ROW(ヒヤリング!$Y$5:$Y$80),0),ROW(ヒヤリング!AA14))),\"\")","v":""}]
[null,15,{"$f":"IFERROR(INDEX(ヒヤリング!Y:Y,1/LARGE(INDEX((ヒヤリング!$Y$5:$Y$80<>\"\")/ROW(ヒヤリング!$Y$5:$Y$80),0),ROW(ヒヤリング!Y15))),\"\")","v":""},{"$f":"IFERROR(INDEX(ヒヤリング!AA:AA,1/LARGE(INDEX((ヒヤリング!$Y$5:$Y$80<>\"\")/ROW(ヒヤリング!$Y$5:$Y$80),0),ROW(ヒヤリング!AA15))),\"\")","v":""}]
[null,16,{"$f":"IFERROR(INDEX(ヒヤリング!Y:Y,1/LARGE(INDEX((ヒヤリング!$Y$5:$Y$80<>\"\")/ROW(ヒヤリング!$Y$5:$Y$80),0),ROW(ヒヤリング!Y16))),\"\")","v":""},{"$f":"IFERROR(INDEX(ヒヤリング!AA:AA,1/LARGE(INDEX((ヒヤリング!$Y$5:$Y$80<>\"\")/ROW(ヒヤリング!$Y$5:$Y$80),0),ROW(ヒヤリング!AA16))),\"\")","v":""}]
[null,17,{"$f":"IFERROR(INDEX(ヒヤリング!Y:Y,1/LARGE(INDEX((ヒヤリング!$Y$5:$Y$80<>\"\")/ROW(ヒヤリング!$Y$5:$Y$80),0),ROW(ヒヤリング!Y17))),\"\")","v":""},{"$f":"IFERROR(INDEX(ヒヤリング!AA:AA,1/LARGE(INDEX((ヒヤリング!$Y$5:$Y$80<>\"\")/ROW(ヒヤリング!$Y$5:$Y$80),0),ROW(ヒヤリング!AA17))),\"\")","v":""}]
[null,18,{"$f":"IFERROR(INDEX(ヒヤリング!Y:Y,1/LARGE(INDEX((ヒヤリング!$Y$5:$Y$80<>\"\")/ROW(ヒヤリング!$Y$5:$Y$80),0),ROW(ヒヤリング!Y18))),\"\")","v":""},{"$f":"IFERROR(INDEX(ヒヤリング!AA:AA,1/LARGE(INDEX((ヒヤリング!$Y$5:$Y$80<>\"\")/ROW(ヒヤリング!$Y$5:$Y$80),0),ROW(ヒヤリング!AA18))),\"\")","v":""}]
[null,19,{"$f":"IFERROR(INDEX(ヒヤリング!Y:Y,1/LARGE(INDEX((ヒヤリング!$Y$5:$Y$80<>\"\")/ROW(ヒヤリング!$Y$5:$Y$80),0),ROW(ヒヤリング!Y19))),\"\")","v":""},{"$f":"IFERROR(INDEX(ヒヤリング!AA:AA,1/LARGE(INDEX((ヒヤリング!$Y$5:$Y$80<>\"\")/ROW(ヒヤリング!$Y$5:$Y$80),0),ROW(ヒヤリング!AA19))),\"\")","v":""}]
[null,20,{"$f":"IFERROR(INDEX(ヒヤリング!Y:Y,1/LARGE(INDEX((ヒヤリング!$Y$5:$Y$80<>\"\")/ROW(ヒヤリング!$Y$5:$Y$80),0),ROW(ヒヤリング!Y20))),\"\")","v":""},{"$f":"IFERROR(INDEX(ヒヤリング!AA:AA,1/LARGE(INDEX((ヒヤリング!$Y$5:$Y$80<>\"\")/ROW(ヒヤリング!$Y$5:$Y$80),0),ROW(ヒヤリング!AA20))),\"\")","v":""}]
[null,21,{"$f":"IFERROR(INDEX(ヒヤリング!Y:Y,1/LARGE(INDEX((ヒヤリング!$Y$5:$Y$80<>\"\")/ROW(ヒヤリング!$Y$5:$Y$80),0),ROW(ヒヤリング!Y21))),\"\")","v":""},{"$f":"IFERROR(INDEX(ヒヤリング!AA:AA,1/LARGE(INDEX((ヒヤリング!$Y$5:$Y$80<>\"\")/ROW(ヒヤリング!$Y$5:$Y$80),0),ROW(ヒヤリング!AA21))),\"\")","v":""}]
[null,22,{"$f":"IFERROR(INDEX(ヒヤリング!Y:Y,1/LARGE(INDEX((ヒヤリング!$Y$5:$Y$80<>\"\")/ROW(ヒヤリング!$Y$5:$Y$80),0),ROW(ヒヤリング!Y22))),\"\")","v":""},{"$f":"IFERROR(INDEX(ヒヤリング!AA:AA,1/LARGE(INDEX((ヒヤリング!$Y$5:$Y$80<>\"\")/ROW(ヒヤリング!$Y$5:$Y$80),0),ROW(ヒヤリング!AA22))),\"\")","v":""}]
[null,23,{"$f":"IFERROR(INDEX(ヒヤリング!Y:Y,1/LARGE(INDEX((ヒヤリング!$Y$5:$Y$80<>\"\")/ROW(ヒヤリング!$Y$5:$Y$80),0),ROW(ヒヤリング!Y23))),\"\")","v":""},{"$f":"IFERROR(INDEX(ヒヤリング!AA:AA,1/LARGE(INDEX((ヒヤリング!$Y$5:$Y$80<>\"\")/ROW(ヒヤリング!$Y$5:$Y$80),0),ROW(ヒヤリング!AA23))),\"\")","v":""}]
[null,24,{"$f":"IFERROR(INDEX(ヒヤリング!Y:Y,1/LARGE(INDEX((ヒヤリング!$Y$5:$Y$80<>\"\")/ROW(ヒヤリング!$Y$5:$Y$80),0),ROW(ヒヤリング!Y24))),\"\")","v":""},{"$f":"IFERROR(INDEX(ヒヤリング!AA:AA,1/LARGE(INDEX((ヒヤリング!$Y$5:$Y$80<>\"\")/ROW(ヒヤリング!$Y$5:$Y$80),0),ROW(ヒヤリング!AA24))),\"\")","v":""}]
[null,25,{"$f":"IFERROR(INDEX(ヒヤリング!Y:Y,1/LARGE(INDEX((ヒヤリング!$Y$5:$Y$80<>\"\")/ROW(ヒヤリング!$Y$5:$Y$80),0),ROW(ヒヤリング!Y25))),\"\")","v":""},{"$f":"IFERROR(INDEX(ヒヤリング!AA:AA,1/LARGE(INDEX((ヒヤリング!$Y$5:$Y$80<>\"\")/ROW(ヒヤリング!$Y$5:$Y$80),0),ROW(ヒヤリング!AA25))),\"\")","v":""}]
[null,26,{"$f":"IFERROR(INDEX(ヒヤリング!Y:Y,1/LARGE(INDEX((ヒヤリング!$Y$5:$Y$80<>\"\")/ROW(ヒヤリング!$Y$5:$Y$80),0),ROW(ヒヤリング!Y26))),\"\")","v":""},{"$f":"IFERROR(INDEX(ヒヤリング!AA:AA,1/LARGE(INDEX((ヒヤリング!$Y$5:$Y$80<>\"\")/ROW(ヒヤリング!$Y$5:$Y$80),0),ROW(ヒヤリング!AA26))),\"\")","v":""}]
[null,27,{"$f":"IFERROR(INDEX(ヒヤリング!Y:Y,1/LARGE(INDEX((ヒヤリング!$Y$5:$Y$80<>\"\")/ROW(ヒヤリング!$Y$5:$Y$80),0),ROW(ヒヤリング!Y27))),\"\")","v":""},{"$f":"IFERROR(INDEX(ヒヤリング!AA:AA,1/LARGE(INDEX((ヒヤリング!$Y$5:$Y$80<>\"\")/ROW(ヒヤリング!$Y$5:$Y$80),0),ROW(ヒヤリング!AA27))),\"\")","v":""}]
[null,28,{"$f":"IFERROR(INDEX(ヒヤリング!Y:Y,1/LARGE(INDEX((ヒヤリング!$Y$5:$Y$80<>\"\")/ROW(ヒヤリング!$Y$5:$Y$80),0),ROW(ヒヤリング!Y28))),\"\")","v":""},{"$f":"IFERROR(INDEX(ヒヤリング!AA:AA,1/LARGE(INDEX((ヒヤリング!$Y$5:$Y$80<>\"\")/ROW(ヒヤリング!$Y$5:$Y$80),0),ROW(ヒヤリング!AA28))),\"\")","v":""}]
[null,29,{"$f":"IFERROR(INDEX(ヒヤリング!Y:Y,1/LARGE(INDEX((ヒヤリング!$Y$5:$Y$80<>\"\")/ROW(ヒヤリング!$Y$5:$Y$80),0),ROW(ヒヤリング!Y29))),\"\")","v":""},{"$f":"IFERROR(INDEX(ヒヤリング!AA:AA,1/LARGE(INDEX((ヒヤリング!$Y$5:$Y$80<>\"\")/ROW(ヒヤリング!$Y$5:$Y$80),0),ROW(ヒヤリング!AA29))),\"\")","v":""}]
[null,30,{"$f":"IFERROR(INDEX(ヒヤリング!Y:Y,1/LARGE(INDEX((ヒヤリング!$Y$5:$Y$80<>\"\")/ROW(ヒヤリング!$Y$5:$Y$80),0),ROW(ヒヤリング!Y30))),\"\")","v":""},{"$f":"IFERROR(INDEX(ヒヤリング!AA:AA,1/LARGE(INDEX((ヒヤリング!$Y$5:$Y$80<>\"\")/ROW(ヒヤリング!$Y$5:$Y$80),0),ROW(ヒヤリング!AA30))),\"\")","v":""}]
[null,null,{"$f":"IFERROR(INDEX(ヒヤリング!Y:Y,1/LARGE(INDEX((ヒヤリング!$Y$5:$Y$80<>\"\")/ROW(ヒヤリング!$Y$5:$Y$80),0),ROW(ヒヤリング!Y35))),\"\")","v":""}]
[null,null,{"$f":"IFERROR(INDEX(ヒヤリング!Y:Y,1/LARGE(INDEX((ヒヤリング!$Y$5:$Y$80<>\"\")/ROW(ヒヤリング!$Y$5:$Y$80),0),ROW(ヒヤリング!Y36))),\"\")","v":""}]
[null,null,{"$f":"IFERROR(INDEX(ヒヤリング!Y:Y,1/LARGE(INDEX((ヒヤリング!$Y$5:$Y$80<>\"\")/ROW(ヒヤリング!$Y$5:$Y$80),0),ROW(ヒヤリング!Y37))),\"\")","v":""}]
[null,null,{"$f":"IFERROR(INDEX(ヒヤリング!Y:Y,1/LARGE(INDEX((ヒヤリング!$Y$5:$Y$80<>\"\")/ROW(ヒヤリング!$Y$5:$Y$80),0),ROW(ヒヤリング!Y38))),\"\")","v":""}]
[null,null,{"$f":"IFERROR(INDEX(ヒヤリング!Y:Y,1/LARGE(INDEX((ヒヤリング!$Y$5:$Y$80<>\"\")/ROW(ヒヤリング!$Y$5:$Y$80),0),ROW(ヒヤリング!Y39))),\"\")","v":""}]
[null,null,{"$f":"IFERROR(INDEX(ヒヤリング!Y:Y,1/LARGE(INDEX((ヒヤリング!$Y$5:$Y$80<>\"\")/ROW(ヒヤリング!$Y$5:$Y$80),0),ROW(ヒヤリング!Y40))),\"\")","v":""}]
[null,null,{"$f":"IFERROR(INDEX(ヒヤリング!Y:Y,1/LARGE(INDEX((ヒヤリング!$Y$5:$Y$80<>\"\")/ROW(ヒヤリング!$Y$5:$Y$80),0),ROW(ヒヤリング!Y41))),\"\")","v":""}]
[null,null,{"$f":"IFERROR(INDEX(ヒヤリング!Y:Y,1/LARGE(INDEX((ヒヤリング!$Y$5:$Y$80<>\"\")/ROW(ヒヤリング!$Y$5:$Y$80),0),ROW(ヒヤリング!Y42))),\"\")","v":""}]
[null,null,{"$f":"IFERROR(INDEX(ヒヤリング!Y:Y,1/LARGE(INDEX((ヒヤリング!$Y$5:$Y$80<>\"\")/ROW(ヒヤリング!$Y$5:$Y$80),0),ROW(ヒヤリング!Y43))),\"\")","v":""}]
[null,null,{"$f":"IFERROR(INDEX(ヒヤリング!Y:Y,1/LARGE(INDEX((ヒヤリング!$Y$5:$Y$80<>\"\")/ROW(ヒヤリング!$Y$5:$Y$80),0),ROW(ヒヤリング!Y44))),\"\")","v":""}]
[null,null,{"$f":"IFERROR(INDEX(ヒヤリング!Y:Y,1/LARGE(INDEX((ヒヤリング!$Y$5:$Y$80<>\"\")/ROW(ヒヤリング!$Y$5:$Y$80),0),ROW(ヒヤリング!Y45))),\"\")","v":""}]
[null,null,{"$f":"IFERROR(INDEX(ヒヤリング!Y:Y,1/LARGE(INDEX((ヒヤリング!$Y$5:$Y$80<>\"\")/ROW(ヒヤリング!$Y$5:$Y$80),0),ROW(ヒヤリング!Y46))),\"\")","v":""}]
[null,null,{"$f":"IFERROR(INDEX(ヒヤリング!Y:Y,1/LARGE(INDEX((ヒヤリング!$Y$5:$Y$80<>\"\")/ROW(ヒヤリング!$Y$5:$Y$80),0),ROW(ヒヤリング!Y47))),\"\")","v":""}]
[null,null,{"$f":"IFERROR(INDEX(ヒヤリング!Y:Y,1/LARGE(INDEX((ヒヤリング!$Y$5:$Y$80<>\"\")/ROW(ヒヤリング!$Y$5:$Y$80),0),ROW(ヒヤリング!Y48))),\"\")","v":""}]
[null,null,{"$f":"IFERROR(INDEX(ヒヤリング!Y:Y,1/LARGE(INDEX((ヒヤリング!$Y$5:$Y$80<>\"\")/ROW(ヒヤリング!$Y$5:$Y$80),0),ROW(ヒヤリング!Y49))),\"\")","v":""}]
[null,null,{"$f":"IFERROR(INDEX(ヒヤリング!Y:Y,1/LARGE(INDEX((ヒヤリング!$Y$5:$Y$80<>\"\")/ROW(ヒヤリング!$Y$5:$Y$80),0),ROW(ヒヤリング!Y50))),\"\")","v":""}]
[null,null,{"$f":"IFERROR(INDEX(ヒヤリング!Y:Y,1/LARGE(INDEX((ヒヤリング!$Y$5:$Y$80<>\"\")/ROW(ヒヤリング!$Y$5:$Y$80),0),ROW(ヒヤリング!Y51))),\"\")","v":""}]
[null,null,{"$f":"IFERROR(INDEX(ヒヤリング!Y:Y,1/LARGE(INDEX((ヒヤリング!$Y$5:$Y$80<>\"\")/ROW(ヒヤリング!$Y$5:$Y$80),0),ROW(ヒヤリング!Y52))),\"\")","v":""}]
[null,null,{"$f":"IFERROR(INDEX(ヒヤリング!Y:Y,1/LARGE(INDEX((ヒヤリング!$Y$5:$Y$80<>\"\")/ROW(ヒヤリング!$Y$5:$Y$80),0),ROW(ヒヤリング!Y53))),\"\")","v":""}]
[null,null,{"$f":"IFERROR(INDEX(ヒヤリング!Y:Y,1/LARGE(INDEX((ヒヤリング!$Y$5:$Y$80<>\"\")/ROW(ヒヤリング!$Y$5:$Y$80),0),ROW(ヒヤリング!Y54))),\"\")","v":""}]
[null,null,{"$f":"IFERROR(INDEX(ヒヤリング!Y:Y,1/LARGE(INDEX((ヒヤリング!$Y$5:$Y$80<>\"\")/ROW(ヒヤリング!$Y$5:$Y$80),0),ROW(ヒヤリング!Y55))),\"\")","v":""}]
[null,null,{"$f":"IFERROR(INDEX(ヒヤリング!Y:Y,1/LARGE(INDEX((ヒヤリング!$Y$5:$Y$80<>\"\")/ROW(ヒヤリング!$Y$5:$Y$80),0),ROW(ヒヤリング!Y56))),\"\")","v":""}]
[null,null,{"$f":"IFERROR(INDEX(ヒヤリング!Y:Y,1/LARGE(INDEX((ヒヤリング!$Y$5:$Y$80<>\"\")/ROW(ヒヤリング!$Y$5:$Y$80),0),ROW(ヒヤリング!Y57))),\"\")","v":""}]
[null,null,{"$f":"IFERROR(INDEX(ヒヤリング!Y:Y,1/LARGE(INDEX((ヒヤリング!$Y$5:$Y$80<>\"\")/ROW(ヒヤリング!$Y$5:$Y$80),0),ROW(ヒヤリング!Y58))),\"\")","v":""}]
[null,null,{"$f":"IFERROR(INDEX(ヒヤリング!Y:Y,1/LARGE(INDEX((ヒヤリング!$Y$5:$Y$80<>\"\")/ROW(ヒヤリング!$Y$5:$Y$80),0),ROW(ヒヤリング!Y59))),\"\")","v":""}]
[null,null,{"$f":"IFERROR(INDEX(ヒヤリング!Y:Y,1/LARGE(INDEX((ヒヤリング!$Y$5:$Y$80<>\"\")/ROW(ヒヤリング!$Y$5:$Y$80),0),ROW(ヒヤリング!Y60))),\"\")","v":""}]
[null,null,{"$f":"IFERROR(INDEX(ヒヤリング!Y:Y,1/LARGE(INDEX((ヒヤリング!$Y$5:$Y$80<>\"\")/ROW(ヒヤリング!$Y$5:$Y$80),0),ROW(ヒヤリング!Y61))),\"\")","v":""}]
[null,null,{"$f":"IFERROR(INDEX(ヒヤリング!Y:Y,1/LARGE(INDEX((ヒヤリング!$Y$5:$Y$80<>\"\")/ROW(ヒヤリング!$Y$5:$Y$80),0),ROW(ヒヤリング!Y62))),\"\")","v":""}]
[null,null,{"$f":"IFERROR(INDEX(ヒヤリング!Y:Y,1/LARGE(INDEX((ヒヤリング!$Y$5:$Y$80<>\"\")/ROW(ヒヤリング!$Y$5:$Y$80),0),ROW(ヒヤリング!Y63))),\"\")","v":""}]
[null,null,{"$f":"IFERROR(INDEX(ヒヤリング!Y:Y,1/LARGE(INDEX((ヒヤリング!$Y$5:$Y$80<>\"\")/ROW(ヒヤリング!$Y$5:$Y$80),0),ROW(ヒヤリング!Y64))),\"\")","v":""}]
[null,null,{"$f":"IFERROR(INDEX(ヒヤリング!Y:Y,1/LARGE(INDEX((ヒヤリング!$Y$5:$Y$80<>\"\")/ROW(ヒヤリング!$Y$5:$Y$80),0),ROW(ヒヤリング!Y65))),\"\")","v":""}]
[null,null,{"$f":"IFERROR(INDEX(ヒヤリング!Y:Y,1/LARGE(INDEX((ヒヤリング!$Y$5:$Y$80<>\"\")/ROW(ヒヤリング!$Y$5:$Y$80),0),ROW(ヒヤリング!Y66))),\"\")","v":""}]
[null,null,{"$f":"IFERROR(INDEX(ヒヤリング!Y:Y,1/LARGE(INDEX((ヒヤリング!$Y$5:$Y$80<>\"\")/ROW(ヒヤリング!$Y$5:$Y$80),0),ROW(ヒヤリング!Y67))),\"\")","v":""}]
[null,null,{"$f":"IFERROR(INDEX(ヒヤリング!Y:Y,1/LARGE(INDEX((ヒヤリング!$Y$5:$Y$80<>\"\")/ROW(ヒヤリング!$Y$5:$Y$80),0),ROW(ヒヤリング!Y68))),\"\")","v":""}]
[null,null,{"$f":"IFERROR(INDEX(ヒヤリング!Y:Y,1/LARGE(INDEX((ヒヤリング!$Y$5:$Y$80<>\"\")/ROW(ヒヤリング!$Y$5:$Y$80),0),ROW(ヒヤリング!Y69))),\"\")","v":""}]
[null,null,{"$f":"IFERROR(INDEX(ヒヤリング!Y:Y,1/LARGE(INDEX((ヒヤリング!$Y$5:$Y$80<>\"\")/ROW(ヒヤリング!$Y$5:$Y$80),0),ROW(ヒヤリング!Y70))),\"\")","v":""}]
[null,null,{"$f":"IFERROR(INDEX(ヒヤリング!Y:Y,1/LARGE(INDEX((ヒヤリング!$Y$5:$Y$80<>\"\")/ROW(ヒヤリング!$Y$5:$Y$80),0),ROW(ヒヤリング!Y71))),\"\")","v":""}]
[null,null,{"$f":"IFERROR(INDEX(ヒヤリング!Y:Y,1/LARGE(INDEX((ヒヤリング!$Y$5:$Y$80<>\"\")/ROW(ヒヤリング!$Y$5:$Y$80),0),ROW(ヒヤリング!Y72))),\"\")","v":""}]
[null,null,{"$f":"IFERROR(INDEX(ヒヤリング!Y:Y,1/LARGE(INDEX((ヒヤリング!$Y$5:$Y$80<>\"\")/ROW(ヒヤリング!$Y$5:$Y$80),0),ROW(ヒヤリング!Y73))),\"\")","v":""}]
[null,null,{"$f":"IFERROR(INDEX(ヒヤリング!Y:Y,1/LARGE(INDEX((ヒヤリング!$Y$5:$Y$80<>\"\")/ROW(ヒヤリング!$Y$5:$Y$80),0),ROW(ヒヤリング!Y74))),\"\")","v":""}]
[null,null,{"$f":"IFERROR(INDEX(ヒヤリング!Y:Y,1/LARGE(INDEX((ヒヤリング!$Y$5:$Y$80<>\"\")/ROW(ヒヤリング!$Y$5:$Y$80),0),ROW(ヒヤリング!Y75))),\"\")","v":""}]
[null,null,{"$f":"IFERROR(INDEX(ヒヤリング!Y:Y,1/LARGE(INDEX((ヒヤリング!$Y$5:$Y$80<>\"\")/ROW(ヒヤリング!$Y$5:$Y$80),0),ROW(ヒヤリング!Y76))),\"\")","v":""}]
[null,null,{"$f":"IFERROR(INDEX(ヒヤリング!Y:Y,1/LARGE(INDEX((ヒヤリング!$Y$5:$Y$80<>\"\")/ROW(ヒヤリング!$Y$5:$Y$80),0),ROW(ヒヤリング!Y77))),\"\")","v":""}]
[null,null,{"$f":"IFERROR(INDEX(ヒヤリング!Y:Y,1/LARGE(INDEX((ヒヤリング!$Y$5:$Y$80<>\"\")/ROW(ヒヤリング!$Y$5:$Y$80),0),ROW(ヒヤリング!Y78))),\"\")","v":""}]
[null,null,{"$f":"IFERROR(INDEX(ヒヤリング!Y:Y,1/LARGE(INDEX((ヒヤリング!$Y$5:$Y$80<>\"\")/ROW(ヒヤリング!$Y$5:$Y$80),0),ROW(ヒヤリング!Y79))),\"\")","v":""}]
[null,null,{"$f":"IFERROR(INDEX(ヒヤリング!Y:Y,1/LARGE(INDEX((ヒヤリング!$Y$5:$Y$80<>\"\")/ROW(ヒヤリング!$Y$5:$Y$80),0),ROW(ヒヤリング!Y80))),\"\")","v":""}]
[null,null,{"$f":"IFERROR(INDEX(ヒヤリング!Y:Y,1/LARGE(INDEX((ヒヤリング!$Y$5:$Y$80<>\"\")/ROW(ヒヤリング!$Y$5:$Y$80),0),ROW(ヒヤリング!Y81))),\"\")","v":""}]
[null,null,{"$f":"IFERROR(INDEX(ヒヤリング!Y:Y,1/LARGE(INDEX((ヒヤリング!$Y$5:$Y$80<>\"\")/ROW(ヒヤリング!$Y$5:$Y$80),0),ROW(ヒヤリング!Y82))),\"\")","v":""}]
{"$rows_left_out":151}